Target
5-hydroxytryptamine receptor 4
Ligand
BDBM29525
Substrate
Meas. Tech.
ChEMBL_875033 (CHEMBL2184351)
IC50
0.21±n/a nM
Citation
 Furlotti, GAlisi, MAApicella, CCapezzone de Joannon, ACazzolla, NCosti, RCuzzucoli Crucitti, GGarrone, BIacovo, AMagarò, GMangano, GMiele, GOmbrato, RPescatori, LPolenzani, LRosi, FVitiello, MDi Santo, R Discovery and pharmacological profile of new 1H-indazole-3-carboxamide and 2H-pyrrolo[3,4-c]quinoline derivatives as selective serotonin 4 receptor ligands. J Med Chem 55:9446-66 (2012)  
Target
Name:
5-hydroxytryptamine receptor 4
Synonyms:
5-HT-4 5-HT4S 5-HT4b 5-HT4d 5-hydroxytryptamine receptor 4 5HT4R_HUMAN Serotonin (5-HT) receptor Serotonin 4 (5-HT4) receptor | Serotonin Receptor 4
Type:
Enzyme
Mol. Mass.:
43767.54
Organism:
Homo sapiens (Human)
Description:
Q13639
Residue:
388
  
Inhibitor
Name:
BDBM29525
Synonyms:
3H-GR113808 GR 113808 [3H]GR113808
Type:
radiolabeled ligand
Emp. Form.:
C19H27N3O4S
Mol. Mass.:
393.5
SMILES:
Cn1cc(C(=O)OCC2CCN(CCNS(C)(=O)=O)CC2)c2ccccc12
: