Target
11-beta-hydroxysteroid dehydrogenase 1
Ligand
BDBM50399348
Substrate
Meas. Tech.
ChEMBL_877632 (CHEMBL2184996)
IC50
4±n/a nM
Citation
 Scott, JSdeSchoolmeester, JKilgour, EMayers, RMPacker, MJHargreaves, DGerhardt, SOgg, DJRees, ASelmi, NStocker, ASwales, JGWhittamore, PR Novel acidic 11ß-hydroxysteroid dehydrogenase type 1 (11ß-HSD1) inhibitor with reduced acyl glucuronide liability: the discovery of 4-[4-(2-adamantylcarbamoyl)-5-tert-butyl-pyrazol-1-yl]benzoic acid (AZD8329). J Med Chem 55:10136-47 (2012)  
Target
Name:
11-beta-hydroxysteroid dehydrogenase 1
Synonyms:
11-DH 11-beta-Hydroxysteroid Dehydrogenase 1 (11-beta-HSD1) 11-beta-hydroxysteroid dehydrogenase 1 (11HSD1) Corticosteroid 11-beta-dehydrogenase isozyme 1 (11-beta-HSD-1) Corticosteroid 11-beta-dehydrogenase isozyme 1 (11beta-HSD1) HSD11 HSD11L | SDR26C1
Type:
Enzyme
Mol. Mass.:
32409.16
Organism:
Homo sapiens (Human)
Description:
P28845
Residue:
292
  
Inhibitor
Name:
BDBM50399348
Synonyms:
CHEMBL2177620
Type:
Small organic molecule
Emp. Form.:
C23H27N3O3S
Mol. Mass.:
425.544
SMILES:
CCSc1c(cnn1-c1ccc(cc1)C(O)=O)C(=O)NC1C2CC3CC(C2)CC1C3
: