Target
Lysosomal alpha-glucosidase
Ligand
BDBM50333455
Substrate
Meas. Tech.
ChEMBL_878682 (CHEMBL2182506)
Ki
85±n/a nM
Citation
 Kato, AHayashi, EMiyauchi, SAdachi, IImahori, TNatori, YYoshimura, YNash, RJShimaoka, HNakagome, IKoseki, JHirono, STakahata, H a-1-C-butyl-1,4-dideoxy-1,4-imino-l-arabinitol as a second-generation iminosugar-based orala-glucosidase inhibitor for improving postprandial hyperglycemia. J Med Chem 55:10347-62 (2012)  
Target
Name:
Lysosomal alpha-glucosidase
Synonyms:
Acidic alpha-glucosidase LYAG_RAT
Type:
PROTEIN
Mol. Mass.:
106191.24
Organism:
Rattus norvegicus
Description:
ChEMBL_1506157
Residue:
953
  
Inhibitor
Name:
BDBM50333455
Synonyms:
(2S,3S,4S,5S)-2-butyl-5-(hydroxymethyl)pyrrolidine-3,4-diol | CHEMBL1641739
Type:
Small organic molecule
Emp. Form.:
C9H19NO3
Mol. Mass.:
189.2521
SMILES:
CCCC[C@@H]1N[C@@H](CO)[C@H](O)[C@H]1O
: