Target
Lysosomal alpha-glucosidase
Ligand
BDBM50399654
Substrate
Meas. Tech.
ChEMBL_878847 (CHEMBL2184155)
IC50
190±n/a nM
Citation
 Kato, AHayashi, EMiyauchi, SAdachi, IImahori, TNatori, YYoshimura, YNash, RJShimaoka, HNakagome, IKoseki, JHirono, STakahata, H a-1-C-butyl-1,4-dideoxy-1,4-imino-l-arabinitol as a second-generation iminosugar-based orala-glucosidase inhibitor for improving postprandial hyperglycemia. J Med Chem 55:10347-62 (2012)  
Target
Name:
Lysosomal alpha-glucosidase
Synonyms:
Acidic alpha-glucosidase LYAG_RAT
Type:
PROTEIN
Mol. Mass.:
106191.24
Organism:
Rattus norvegicus
Description:
ChEMBL_1506157
Residue:
953
  
Inhibitor
Name:
BDBM50399654
Synonyms:
CHEMBL2177691
Type:
Small organic molecule
Emp. Form.:
C11H23NO3
Mol. Mass.:
217.3052
SMILES:
CC(C)CCC[C@@H]1N[C@@H](CO)[C@H](O)[C@H]1O
: