Target
Carbonic anhydrase 2
Ligand
BDBM13076
Substrate
Meas. Tech.
ChEMBL_878956 (CHEMBL2185519)
Ki
290±n/a nM
Citation
 Del Prete, SIsik, SVullo, DDe Luca, VCarginale, VScozzafava, ASupuran, CTCapasso, C DNA cloning, characterization, and inhibition studies of ana-carbonic anhydrase from the pathogenic bacterium Vibrio cholerae. J Med Chem 55:10742-8 (2012)  
Target
Name:
Carbonic anhydrase 2
Synonyms:
CA-II CAC Carbonate dehydratase II Carbonic anhydrase 2 (CA-II) Carbonic anhydrase C Carbonic anhydrase II (CA-II) Carbonic anhydrase II (hCA II) | Carbonic anhydrase isoenzyme II (hCA II)
Type:
Enzyme
Mol. Mass.:
29250.71
Organism:
Homo sapiens (Human)
Description:
P00918
Residue:
260
  
Inhibitor
Name:
BDBM13076
Synonyms:
6-chloro-1,1-dioxo-3,4-dihydro-2H-1,2,4-benzothiadiazine-7-sulfonamide Dichlothiazide Hydrochlorothiazide JFD00715 cid_3639
Type:
Small organic molecule
Emp. Form.:
C7H8ClN3O4S2
Mol. Mass.:
297.739
SMILES:
NS(=O)(=O)c1cc2c(NCNS2(=O)=O)cc1Cl
: