Target
Potassium voltage-gated channel subfamily H member 2
Ligand
BDBM50400519
Substrate
Meas. Tech.
ChEMBL_879794 (CHEMBL2210522)
Ki
377±n/a nM
Citation
 He, SYe, ZTruong, QShah, SDu, WGuo, LDobbelaar, PHLai, ZLiu, JJian, TQi, HBakshi, RKHong, QDellureficio, JPasternak, AFeng, ZdeJesus, RYang, LReibarkh, MBradley, SAHolmes, MABall, RGRuck, RTHuffman, MAWong, FSamuel, KReddy, VBMitelman, STong, SXChicchi, GGTsao, KLTrusca, DWu, MShao, QTrujillo, MEEiermann, GJLi, CZhang, BBHoward, ADZhou, YPNargund, RPHagmann, WK The Discovery of MK-4256, a Potent SSTR3 Antagonist as a Potential Treatment of Type 2 Diabetes. ACS Med Chem Lett 3:484-489 (2012)  
Target
Name:
Potassium voltage-gated channel subfamily H member 2
Synonyms:
1,3-beta-glucan synthase component GLS2 ERG Eag-related protein 1 Ether-a-go-go-related gene (HERG) Ether-a-go-go-related gene potassium channel 1 Ether-a-go-go-related gene potassium channel 1 (hERG1) Ether-a-go-go-related protein 1 H-ERG KCNH2 Potassium voltage-gated channel subfamily H member 2 (hERG) Voltage-gated potassium channel subunit Kv11.1 hERG Potassium Channel 1 | putative potassium channel subunit
Type:
Multi-pass membrane protein
Mol. Mass.:
126672.65
Organism:
Homo sapiens (Human)
Description:
Q12809
Residue:
1159
  
Inhibitor
Name:
BDBM50400519
Synonyms:
CHEMBL2204941
Type:
Small organic molecule
Emp. Form.:
C25H25FN4O
Mol. Mass.:
416.4906
SMILES:
Fc1ccc(cc1)-c1c[nH]c(n1)[C@H]1Cc2c([nH]c3ccccc23)[C@H](N1)C1CCOCC1
: