Target
Aminopeptidase N
Ligand
BDBM50400529
Substrate
Meas. Tech.
ChEMBL_879875 (CHEMBL2211412)
IC50
2260±n/a nM
Citation
 Su, LCao, JJia, YZhang, XFang, HXu, W Development of Synthetic Aminopeptidase N/CD13 Inhibitors to Overcome Cancer Metastasis and Angiogenesis. ACS Med Chem Lett 3:959-964 (2012)  
Target
Name:
Aminopeptidase N
Synonyms:
AMPN_MOUSE AP-N Anpep Lap-1 Membrane protein p161 mAPN
Type:
PROTEIN
Mol. Mass.:
109642.29
Organism:
Mus musculus
Description:
ChEMBL_879875
Residue:
966
  
Inhibitor
Name:
BDBM50400529
Synonyms:
CHEMBL2204943
Type:
Small organic molecule
Emp. Form.:
C17H21N3O3
Mol. Mass.:
315.3669
SMILES:
CC(C)C[C@H](NC(=O)Nc1cccc2ccccc12)C(=O)NO
: