Target
72 kDa type IV collagenase
Ligand
BDBM50400541
Substrate
Meas. Tech.
ChEMBL_879811 (CHEMBL2210539)
IC50
>1000000±n/a nM
Citation
 Su, LCao, JJia, YZhang, XFang, HXu, W Development of Synthetic Aminopeptidase N/CD13 Inhibitors to Overcome Cancer Metastasis and Angiogenesis. ACS Med Chem Lett 3:959-964 (2012)  
Target
Name:
72 kDa type IV collagenase
Synonyms:
72 kDa gelatinase CLG4A Gelatinase A (MMP-2) MMP2_HUMAN Matrix metalloproteinase-2 (MMP 2) Matrix metalloproteinases 2 (MMP-2) | TBE-1
Type:
Enzyme
Mol. Mass.:
73870.36
Organism:
Homo sapiens (Human)
Description:
P08253
Residue:
660
  
Inhibitor
Name:
BDBM50400541
Synonyms:
CHEMBL2204950
Type:
Small organic molecule
Emp. Form.:
C15H23N3O4
Mol. Mass.:
309.3608
SMILES:
COc1cccc(CNC(=O)N[C@@H](CC(C)C)C(=O)NO)c1
: