Target
Beta-galactoside-binding lectin
Ligand
BDBM50370453
Substrate
Meas. Tech.
ChEMBL_884641 (CHEMBL2214657)
IC50
4000000±n/a nM
Citation
 André, SJarikote, DVYan, DVincenz, LWang, GNKaltner, HMurphy, PVGabius, HJ Synthesis of bivalent lactosides and their activity as sensors for differences between lectins in inter- and intrafamily comparisons. Bioorg Med Chem Lett 22:313-8 (2011)  
Target
Name:
Beta-galactoside-binding lectin
Synonyms:
14 kDa lectin CG-1B LEG4_CHICK
Type:
PROTEIN
Mol. Mass.:
15064.98
Organism:
Gallus gallus
Description:
ChEMBL_884641
Residue:
135
  
Inhibitor
Name:
BDBM50370453
Synonyms:
LACTOSE | Lactose, anhydrous
Type:
Small organic molecule
Emp. Form.:
C12H22O11
Mol. Mass.:
342.2965
SMILES:
OC[C@H]1O[C@@H](O[C@H]2[C@H](O)[C@@H](O)[C@H](O)O[C@@H]2CO)[C@H](O)[C@@H](O)[C@H]1O
: