Target
Seed linoleate 13S-lipoxygenase-1
Ligand
BDBM50401193
Substrate
Meas. Tech.
ChEMBL_881722 (CHEMBL2210180)
Ki
9800±n/a nM
Citation
 Wisastra, RGhizzoni, MBoltjes, AHaisma, HJDekker, FJ Anacardic acid derived salicylates are inhibitors or activators of lipoxygenases. Bioorg Med Chem 20:5027-32 (2012)  
Target
Name:
Seed linoleate 13S-lipoxygenase-1
Synonyms:
15-LOX 15-lipo-oxygenase (SLO) L-1 LOX1.1 Lipoxygenase (LOX) Lipoxygenase-1 | Seed lipoxygenase-1
Type:
Enzyme
Mol. Mass.:
94365.66
Organism:
Glycine max (soybean)
Description:
Residue:
839
  
Inhibitor
Name:
BDBM50401193
Synonyms:
CHEMBL1934604
Type:
Small organic molecule
Emp. Form.:
C22H28O4
Mol. Mass.:
356.4553
SMILES:
CCCCCCCc1ccc(CCc2cc(O)cc(O)c2C(O)=O)cc1
: