Target
Pancreatic alpha-amylase
Ligand
BDBM50401967
Substrate
Meas. Tech.
ChEMBL_886576 (CHEMBL2215736)
IC50
17430±n/a nM
Citation
 Patil, VSNandre, KPGhosh, SRao, VJChopade, BABhosale, SVBhosale, SV Synthesis and glycosidase inhibitory activity of novel (2-phenyl-4H-benzopyrimedo[2,1-b]-thiazol-4-yliden)acetonitrile derivatives. Bioorg Med Chem Lett 22:7011-4 (2012)  
Target
Name:
Pancreatic alpha-amylase
Synonyms:
1,4-alpha-D-glucan glucanohydrolase AMYP_PIG Pancreatic α-amylase
Type:
Protein
Mol. Mass.:
57088.07
Organism:
Sus scrofa (Pig)
Description:
P00690
Residue:
511
  
Inhibitor
Name:
BDBM50401967
Synonyms:
CHEMBL2207959
Type:
Small organic molecule
Emp. Form.:
C19H12BrN3OS
Mol. Mass.:
410.287
SMILES:
COc1ccc2N3C(Sc2c1)=NC(=C\C3=C/C#N)c1ccc(Br)cc1
: