Target
Amine oxidase [flavin-containing] A
Ligand
BDBM50402321
Substrate
Meas. Tech.
ChEMBL_885770 (CHEMBL2213281)
IC50
6480±n/a nM
Citation
 Mostert, SMentz, WPetzer, ABergh, JJPetzer, JP Inhibition of monoamine oxidase by 8-[(phenylethyl)sulfanyl]caffeine analogues. Bioorg Med Chem 20:7040-50 (2012)  
Target
Name:
Amine oxidase [flavin-containing] A
Synonyms:
AOFA_HUMAN MAO-A Monoamine oxidase Monoamine oxidase type A (MAO A) Monoamine oxidase type A (MAOA)
Type:
Protein
Mol. Mass.:
59689.53
Organism:
Homo sapiens (Human)
Description:
P21397
Residue:
527
  
Inhibitor
Name:
BDBM50402321
Synonyms:
CHEMBL2206102
Type:
Small organic molecule
Emp. Form.:
C17H20N4O2S
Mol. Mass.:
344.431
SMILES:
Cn1c(SCCCc2ccccc2)nc2n(C)c(=O)n(C)c(=O)c12
: