Target
Carnitine O-palmitoyltransferase 1, muscle isoform
Ligand
BDBM61402
Substrate
Meas. Tech.
ChEMBL_887462 (CHEMBL2217071)
IC50
>100000±n/a nM
Citation
 Ceccarelli, SMChomienne, OGubler, MArduini, A Carnitine palmitoyltransferase (CPT) modulators: a medicinal chemistry perspective on 35 years of research. J Med Chem 54:3109-52 (2011)  
Target
Name:
Carnitine O-palmitoyltransferase 1, muscle isoform
Synonyms:
CPT I CPT1B CPTI-M Carnitine palmitoyltransferase I-like protein | KIAA1670
Type:
PROTEIN
Mol. Mass.:
87823.36
Organism:
Homo sapiens (Human)
Description:
ChEMBL_887440
Residue:
772
  
Inhibitor
Name:
BDBM61402
Synonyms:
(Z)-2-butenedioic acid;2-(2,2-dicyclohexylethyl)piperidine 2-(2,2-dicyclohexylethyl)piperidine;maleic acid CHEMBL75880 Perhexiline cid_5284439 | perhexiline maleate
Type:
Small organic molecule
Emp. Form.:
C19H35N
Mol. Mass.:
277.4879
SMILES:
C(C(C1CCCCC1)C1CCCCC1)C1CCCCN1
: