Target
Thromboxane-A synthase
Ligand
BDBM50003795
Substrate
Meas. Tech.
ChEMBL_212942 (CHEMBL816758)
IC50
32±n/a nM
Citation
 Campbell, ICollington, EFinch, HHayes, RLumley, PMills, KRobertson, GWharton, KWatts, I Synthesis and pharmacological evaluation of combined Thromboxane receptor antagonists/thromboxane synthase inhibitors: Pyridine-containing amino-prostanoids Bioorg Med Chem Lett 1:695-698 (1991)    Article 
Target
Name:
Thromboxane-A synthase
Synonyms:
CYP5 Cytochrome P450 5A1 TBXAS1 TXA synthase TXS Thromboxane A2 Synthase (P450 TxA2) Thromboxane prostanoid Thromboxane-A synthase
Type:
Enzyme
Mol. Mass.:
60524.67
Organism:
Homo sapiens (Human)
Description:
P24557
Residue:
533
  
Inhibitor
Name:
BDBM50003795
Synonyms:
5-[1-Pyridin-3-yl-1-(3-trifluoromethyl-phenyl)-meth-(E)-ylideneaminooxy]-pentanoic acid CHEMBL280728 ridogrel
Type:
Small organic molecule
Emp. Form.:
C18H17F3N2O3
Mol. Mass.:
366.3344
SMILES:
OC(=O)CCCCO\N=C(\c1cccnc1)c1cccc(c1)C(F)(F)F
: