Target
Type-1 angiotensin II receptor
Ligand
BDBM82258
Substrate
Meas. Tech.
ChEMBL_36318 (CHEMBL652267)
Kd
1.58±n/a nM
Citation
 Murray, WLalan, PGill, ALee, DFalotico, RLewis, JAddo, MWachter, M Substituted lactam biphenyltetrazoles as angiotensin II mediated antihypertensives Bioorg Med Chem Lett 4:87-92 (1994)    Article 
Target
Name:
Type-1 angiotensin II receptor
Synonyms:
AGTR1 ANGIOTENSIN AT1 Angiotensin II type 1a (AT-1a) receptor
Type:
Enzyme Catalytic Domain
Mol. Mass.:
41009.15
Organism:
RABBIT
Description:
ANGIOTENSIN AT1 AGTR1 RABBIT::P34976
Residue:
359
  
Inhibitor
Name:
BDBM82258
Synonyms:
CAS_114798-26-4 NSC_3961
Type:
Small organic molecule
Emp. Form.:
C22H23ClN6O
Mol. Mass.:
422.911
SMILES:
CCCCc1nc(Cl)c(CO)n1Cc1ccc(cc1)-c1ccccc1-c1nnn[nH]1
: