Target
Cytochrome P450 2B1
Ligand
BDBM50404901
Substrate
Meas. Tech.
ChEMBL_35524 (CHEMBL644757)
IC50
91201.08±n/a nM
Citation
 Murray, MRyan, AJLittle, PJ Inhibition of rat hepatic microsomal aminopyrine N-demethylase activity by benzimidazole derivatives. Quantitative structure-activity relationships. J Med Chem 25:887-92 (1982)  
Target
Name:
Cytochrome P450 2B1
Synonyms:
CP2B1_RAT Cyp2b1
Type:
PROTEIN
Mol. Mass.:
55940.51
Organism:
Rattus norvegicus
Description:
ChEMBL_774167
Residue:
491
  
Inhibitor
Name:
BDBM50404901
Synonyms:
BENDAZOL
Type:
Small organic molecule
Emp. Form.:
C14H12N2
Mol. Mass.:
208.2585
SMILES:
C(c1nc2ccccc2[nH]1)c1ccccc1
: