Target
2-Hydroxyacid oxidase 1
Ligand
BDBM50405010
Substrate
Meas. Tech.
ChEMBL_71275 (CHEMBL685164)
IC50
440±n/a nM
Citation
 Williams, HWEichler, ERandall, WCRooney, CSCragoe, EJStreeter, KBSchwam, HMichelson, SRPatchett, AATaub, D Inhibitors of glycolic acid oxidase. 4-substituted 2,4-dioxobutanoic acid derivatives. J Med Chem 26:1196-200 (1983)  
Target
Name:
2-Hydroxyacid oxidase 1
Synonyms:
GOX1 HAOX1_HUMAN | Hydroxyacid oxidase 1
Type:
PROTEIN
Mol. Mass.:
40927.89
Organism:
Homo sapiens (Human)
Description:
ChEMBL_71275
Residue:
370
  
Inhibitor
Name:
BDBM50405010
Synonyms:
CHEMBL18672
Type:
Small organic molecule
Emp. Form.:
C17H12Cl2O4
Mol. Mass.:
351.181
SMILES:
OC(=O)C(=O)CC(=O)c1ccc(Cc2ccc(Cl)c(Cl)c2)cc1
: