Target
DNA topoisomerase 3
Ligand
BDBM50405104
Substrate
Meas. Tech.
ChEMBL_54525 (CHEMBL858266)
Ki
14191±n/a nM
Citation
 Wright, GEGambino, JJ Quantitative structure-activity relationships of 6-anilinouracils as inhibitors of Bacillus subtilis DNA polymerase III. J Med Chem 27:181-5 (1984)  
Target
Name:
DNA topoisomerase 3
Synonyms:
DNA topoisomerase III topB
Type:
PROTEIN
Mol. Mass.:
81515.22
Organism:
Bacillus subtilis
Description:
ChEMBL_54525
Residue:
727
  
Inhibitor
Name:
BDBM50405104
Synonyms:
CHEMBL54814
Type:
Small organic molecule
Emp. Form.:
C13H15N3O2
Mol. Mass.:
245.2771
SMILES:
CCCc1cccc(Nc2cc(=O)[nH]c(=O)[nH]2)c1
: