Target
Dihydrofolate reductase
Ligand
BDBM50291778
Substrate
Meas. Tech.
ChEMBL_53000 (CHEMBL858265)
Ki
3.24±n/a nM
Citation
 Marlowe, CKSelassie, CDSanti, DV Quantitative structure-activity relationships of the inhibition of Pneumocystis carinii dihydrofolate reductase by 4,6-diamino-1,2-dihydro-2,2-dimethyl-1-(X-phenyl)-s-triazines. J Med Chem 38:967-72 (1995)  
Target
Name:
Dihydrofolate reductase
Synonyms:
DYR_PNECA Dihydrofolate reductase Tetrahydrofolate dehydrogenase
Type:
Enzyme
Mol. Mass.:
23891.29
Organism:
Pneumocystis carinii
Description:
Residue:
206
  
Inhibitor
Name:
BDBM50291778
Synonyms:
CHEMBL20812 | N-{3-[3-(4,6-Diamino-2,2-dimethyl-2H-[1,3,5]triazin-1-yl)-benzyloxy]-phenyl}-acetamide
Type:
Small organic molecule
Emp. Form.:
C20H24N6O2
Mol. Mass.:
380.4436
SMILES:
CC(=O)Nc1cccc(OCc2cccc(c2)N2C(N)=NC(N)=NC2(C)C)c1
: