Target
Dihydrofolate reductase
Ligand
BDBM50291773
Substrate
Meas. Tech.
ChEMBL_53000 (CHEMBL858265)
Ki
1174.9±n/a nM
Citation
 Marlowe, CKSelassie, CDSanti, DV Quantitative structure-activity relationships of the inhibition of Pneumocystis carinii dihydrofolate reductase by 4,6-diamino-1,2-dihydro-2,2-dimethyl-1-(X-phenyl)-s-triazines. J Med Chem 38:967-72 (1995)  
Target
Name:
Dihydrofolate reductase
Synonyms:
DYR_PNECA Dihydrofolate reductase Tetrahydrofolate dehydrogenase
Type:
Enzyme
Mol. Mass.:
23891.29
Organism:
Pneumocystis carinii
Description:
Residue:
206
  
Inhibitor
Name:
BDBM50291773
Synonyms:
CHEMBL21051 | [3-(4,6-Diamino-2,2-dimethyl-2H-[1,3,5]triazin-1-yl)-phenyl]-phenyl-methanol
Type:
Small organic molecule
Emp. Form.:
C18H21N5O
Mol. Mass.:
323.3922
SMILES:
CC1(C)N=C(N)N=C(N)N1c1cccc(c1)C(O)c1ccccc1
: