Target
Dihydrofolate reductase
Ligand
BDBM50291786
Substrate
Meas. Tech.
ChEMBL_53000 (CHEMBL858265)
Ki
21.38±n/a nM
Citation
 Marlowe, CKSelassie, CDSanti, DV Quantitative structure-activity relationships of the inhibition of Pneumocystis carinii dihydrofolate reductase by 4,6-diamino-1,2-dihydro-2,2-dimethyl-1-(X-phenyl)-s-triazines. J Med Chem 38:967-72 (1995)  
Target
Name:
Dihydrofolate reductase
Synonyms:
DYR_PNECA Dihydrofolate reductase Tetrahydrofolate dehydrogenase
Type:
Enzyme
Mol. Mass.:
23891.29
Organism:
Pneumocystis carinii
Description:
Residue:
206
  
Inhibitor
Name:
BDBM50291786
Synonyms:
1-(3-Hexyloxy-phenyl)-6,6-dimethyl-1,6-dihydro-[1,3,5]triazine-2,4-diamine | CHEMBL21032
Type:
Small organic molecule
Emp. Form.:
C17H27N5O
Mol. Mass.:
317.4292
SMILES:
CCCCCCOc1cccc(c1)N1C(N)=NC(N)=NC1(C)C
: