Target
Translocator protein
Ligand
BDBM50408036
Substrate
Meas. Tech.
ChEMBL_38119 (CHEMBL650074)
IC50
13300000±n/a nM
Citation
 So, SSKarplus, M Genetic neural networks for quantitative structure-activity relationships: improvements and application of benzodiazepine affinity for benzodiazepine/GABAA receptors. J Med Chem 39:5246-56 (1997)  
Target
Name:
Translocator protein
Synonyms:
BZRP Mitochondrial benzodiazepine receptor PKBS Peripheral-type benzodiazepine receptor TSPO_HUMAN
Type:
Enzyme
Mol. Mass.:
18834.74
Organism:
Homo sapiens (Human)
Description:
P30536
Residue:
169
  
Inhibitor
Name:
BDBM50408036
Synonyms:
7-Aminoclonazepam Ro-05-4619
Type:
Small organic molecule
Emp. Form.:
C15H12ClN3O
Mol. Mass.:
285.728
SMILES:
Nc1ccc2NC(=O)CN=C(c3ccccc3Cl)c2c1
: