Target
Potassium voltage-gated channel subfamily H member 2
Ligand
BDBM30130
Substrate
Meas. Tech.
ChEMBL_307245 (CHEMBL829152)
IC50
1513.56±n/a nM
Citation
 Tobita, MNishikawa, TNagashima, R A discriminant model constructed by the support vector machine method for HERG potassium channel inhibitors. Bioorg Med Chem Lett 15:2886-90 (2005)  
Target
Name:
Potassium voltage-gated channel subfamily H member 2
Synonyms:
1,3-beta-glucan synthase component GLS2 ERG Eag-related protein 1 Ether-a-go-go-related gene (HERG) Ether-a-go-go-related gene potassium channel 1 Ether-a-go-go-related gene potassium channel 1 (hERG1) Ether-a-go-go-related protein 1 H-ERG KCNH2 Potassium voltage-gated channel subfamily H member 2 (hERG) Voltage-gated potassium channel subunit Kv11.1 hERG Potassium Channel 1 | putative potassium channel subunit
Type:
Multi-pass membrane protein
Mol. Mass.:
126672.65
Organism:
Homo sapiens (Human)
Description:
Q12809
Residue:
1159
  
Inhibitor
Name:
BDBM30130
Synonyms:
CHEMBL1201082 Fluoxetin Prozac cid_62857
Type:
Small organic molecule
Emp. Form.:
C17H18F3NO
Mol. Mass.:
309.3261
SMILES:
CNCCC(Oc1ccc(cc1)C(F)(F)F)c1ccccc1
: