Target
D(4) dopamine receptor
Ligand
BDBM50061349
Substrate
Meas. Tech.
ChEMBL_307376 (CHEMBL875566)
Ki
0.309±n/a nM
Citation
 Hansch, CVerma, RPKurup, AMekapati, SB The role of QSAR in dopamine interactions. Bioorg Med Chem Lett 15:2149-57 (2005)  
Target
Name:
D(4) dopamine receptor
Synonyms:
D(2C) dopamine receptor DOPAMINE D4.2 DRD4 Dopamine D4 receptor
Type:
Enzyme
Mol. Mass.:
48373.19
Organism:
Homo sapiens (Human)
Description:
P21917
Residue:
419
  
Inhibitor
Name:
BDBM50061349
Synonyms:
CHEMBL129534 | [2-(3-Chloro-phenoxy)-ethyl]-(3-phenoxy-propyl)-amine
Type:
Small organic molecule
Emp. Form.:
C17H20ClNO2
Mol. Mass.:
305.799
SMILES:
Clc1cccc(OCCNCCCOc2ccccc2)c1
: