Target
5-hydroxytryptamine receptor 1D
Ligand
BDBM50410430
Substrate
Meas. Tech.
ChEMBL_321089 (CHEMBL883692)
Ki
0.631±n/a nM
Citation
 Heightman, TDGaster, LMPardoe, SLPilleux, JPHadley, MSMiddlemiss, DNPrice, GWRoberts, CScott, CMWatson, JMGordon, LJHolland, VAPowles, JRiley, GJStean, TOTrail, BKUpton, NAustin, NEAyrton, ADColeman, TCutler, L 8-Piperazinyl-2,3-dihydropyrrolo[3,2-g]isoquinolines: potent, selective, orally bioavailable 5-HT1 receptor ligands. Bioorg Med Chem Lett 15:4370-4 (2005)  
Target
Name:
5-hydroxytryptamine receptor 1D
Synonyms:
5-HT-1D 5-HT1D 5HT1D_HUMAN HTR1DA Serotonin (5-HT) receptor | Serotonin Receptor 1D
Type:
G Protein-Coupled Receptor (GPCR)
Mol. Mass.:
41920.63
Organism:
Homo sapiens (Human)
Description:
Receptor binding assays were performed using human clone stably expressed in CHO cells.
Residue:
377
  
Inhibitor
Name:
BDBM50410430
Synonyms:
CHEMBL372743
Type:
Small organic molecule
Emp. Form.:
C29H29N7O
Mol. Mass.:
491.5869
SMILES:
CCc1c(cnn1-c1ccc(cc1)C#N)C(=O)N1CCc2cc3ccnc(N4CCN(C)CC4)c3cc12
: