Target
Androgen receptor
Ligand
BDBM50410531
Substrate
Meas. Tech.
ChEMBL_321687 (CHEMBL872182)
IC50
15.85±n/a nM
Citation
 Lill, MAWiniger, FVedani, AErnst, B Impact of induced fit on ligand binding to the androgen receptor: a multidimensional QSAR study to predict endocrine-disrupting effects of environmental chemicals. J Med Chem 48:5666-74 (2005)  
Target
Name:
Androgen receptor
Synonyms:
ANDR_RAT Ar Nr3c4 | androgen
Type:
Enzyme
Mol. Mass.:
98219.08
Organism:
Rattus norvegicus (Rat)
Description:
P15207
Residue:
902
  
Inhibitor
Name:
BDBM50410531
Synonyms:
Android Android 25 METHYLTESTOSTERONE Methitest
Type:
Small organic molecule
Emp. Form.:
C20H30O2
Mol. Mass.:
302.451
SMILES:
C[C@]1(O)CC[C@H]2[C@@H]3CCC4=CC(=O)CC[C@]4(C)[C@H]3CC[C@]12C
: