Target
C-C chemokine receptor type 8
Ligand
BDBM50414969
Substrate
Meas. Tech.
ChEMBL_465785 (CHEMBL948147)
IC50
33±n/a nM
Citation
 Shamovsky, IConnolly, SDavid, LIvanova, SNordén, BSpringthorpe, BUrbahns, K Overcoming undesirable HERG potency of chemokine receptor antagonists using baseline lipophilicity relationships. J Med Chem 51:1162-78 (2008)  
Target
Name:
C-C chemokine receptor type 8
Synonyms:
CCR8 CKRL1 CMKBRL2
Type:
PROTEIN
Mol. Mass.:
40855.53
Organism:
Homo sapiens (Human)
Description:
ChEMBL_454278
Residue:
355
  
Inhibitor
Name:
BDBM50414969
Synonyms:
CHEMBL272022
Type:
Small organic molecule
Emp. Form.:
C29H33N3O4
Mol. Mass.:
487.59
SMILES:
COc1ccccc1Oc1cccc(CN2CCC3(CC2)CCN(CC3)C(=O)c2cc[n+]([O-])cc2)c1
: