Target
C-C chemokine receptor type 8
Ligand
BDBM50411749
Substrate
Meas. Tech.
ChEMBL_465785 (CHEMBL948147)
IC50
16±n/a nM
Citation
 Shamovsky, IConnolly, SDavid, LIvanova, SNordén, BSpringthorpe, BUrbahns, K Overcoming undesirable HERG potency of chemokine receptor antagonists using baseline lipophilicity relationships. J Med Chem 51:1162-78 (2008)  
Target
Name:
C-C chemokine receptor type 8
Synonyms:
CCR8 CKRL1 CMKBRL2
Type:
PROTEIN
Mol. Mass.:
40855.53
Organism:
Homo sapiens (Human)
Description:
ChEMBL_454278
Residue:
355
  
Inhibitor
Name:
BDBM50411749
Synonyms:
CHEMBL271127
Type:
Small organic molecule
Emp. Form.:
C29H33N3O3
Mol. Mass.:
471.5906
SMILES:
COc1ccccc1Oc1ccccc1CN1CCC2(CC1)CCN(CC2)C(=O)c1ccccn1
: