Target
Muscarinic acetylcholine receptor M2
Ligand
BDBM50412340
Substrate
Meas. Tech.
ChEMBL_510511 (CHEMBL996047)
Ki
3.16±n/a nM
Citation
 Jin, JWang, YShi, DWang, FDavis, RSJin, QFu, WFoley, JJWebb, EFDehaas, CJBerlanga, MBurman, MSarau, HMMorrow, DMRao, PKallal, LAMoore, MLRivero, RAPalovich, MSalmon, MBelmonte, KEBusch-Petersen, J Discovery of novel and long acting muscarinic acetylcholine receptor antagonists. J Med Chem 51:4866-9 (2008)  
Target
Name:
Muscarinic acetylcholine receptor M2
Synonyms:
ACM2_HUMAN Cholinergic, muscarinic M2 Muscarinic acetylcholine receptor M2 and M5 | RecName: Full=Muscarinic acetylcholine receptor M2
Type:
GPCR
Mol. Mass.:
51730.61
Organism:
Homo sapiens (Human)
Description:
P08172
Residue:
466
  
Inhibitor
Name:
BDBM50412340
Synonyms:
CHEMBL540359
Type:
Small organic molecule
Emp. Form.:
C33H41N4O6
Mol. Mass.:
589.7013
SMILES:
CC(C)OC(=O)c1ccc(NC(=O)N[C@@H](Cc2ccc(O)cc2)C(=O)N[C@H]2CCC[N+](C)(Cc3cccc(O)c3)C2)cc1
: