Target
Salicyl-AMP ligase / salicyl-S-ArCP synthetase
Ligand
BDBM50413190
Substrate
Meas. Tech.
ChEMBL_493446 (CHEMBL942239)
Ki
2.3±n/a nM
Citation
 Labello, NPBennett, EMFerguson, DMAldrich, CC Quantitative three dimensional structure linear interaction energy model of 5'-O-[N-(salicyl)sulfamoyl]adenosine and the aryl acid adenylating enzyme MbtA. J Med Chem 51:7154-60 (2009)  
Target
Name:
Salicyl-AMP ligase / salicyl-S-ArCP synthetase
Synonyms:
2,3-dihydroxybenzoate-AMP ligase mbtA
Type:
PROTEIN
Mol. Mass.:
59275.32
Organism:
Mycobacterium tuberculosis
Description:
ChEMBL_423930
Residue:
565
  
Inhibitor
Name:
BDBM50413190
Synonyms:
CHEMBL609107
Type:
Small organic molecule
Emp. Form.:
C18H20N6O7S
Mol. Mass.:
464.452
SMILES:
Nc1ncnc2n(cnc12)C1CC(COS(=O)(=O)NC(=O)c2ccccc2O)C(O)C1O
: