Target
Retinoic acid receptor alpha
Ligand
BDBM50413255
Substrate
Meas. Tech.
ChEMBL_542839 (CHEMBL1022116)
EC50
1584.89±n/a nM
Citation
 Lund, BWKnapp, AEPiu, FGauthier, NKBegtrup, MHacksell, UOlsson, R Design, synthesis, and structure-activity analysis of isoform-selective retinoic acid receptor beta ligands. J Med Chem 52:1540-5 (2009)  
Target
Name:
Retinoic acid receptor alpha
Synonyms:
NR1B1 RAR-alpha RARA_HUMAN Retinoic acid receptor alpha/Retinoid X receptor alpha Retinoid receptor
Type:
PROTEIN
Mol. Mass.:
50778.87
Organism:
Homo sapiens (Human)
Description:
ChEMBL_1466191
Residue:
462
  
Inhibitor
Name:
BDBM50413255
Synonyms:
CHEMBL513760
Type:
Small organic molecule
Emp. Form.:
C19H21FO4
Mol. Mass.:
332.366
SMILES:
CCCCOCCOc1ccc(cc1)-c1ccc(C(O)=O)c(F)c1
: