Target
5-hydroxytryptamine receptor 1A
Ligand
BDBM50413560
Substrate
Meas. Tech.
ChEMBL_501239 (CHEMBL975274)
Ki
0.2±n/a nM
Citation
 Bromidge, SMBertani, BBorriello, MBozzoli, AFaedo, SGianotti, MGordon, LJHill, MZucchelli, VWatson, JMZonzini, L 8-[2-(4-Aryl-1-piperazinyl)ethyl]-2H-1,4-benzoxazin-3(4H)-ones: dual-acting 5-HT1 receptor antagonists and serotonin reuptake inhibitors--part II. Bioorg Med Chem Lett 19:2338-42 (2009)  
Target
Name:
5-hydroxytryptamine receptor 1A
Synonyms:
5-HT-1A 5-hydroxytryptamine receptor 1A (5-HT-1A) ADRB2RL1 Dopamine D2 receptor and serotonin 1a receptor HTR1A | Serotonin receptor 1A
Type:
Mol. Mass.:
46122.49
Organism:
Homo sapiens (Human)
Description:
Residue:
422
  
Inhibitor
Name:
BDBM50413560
Synonyms:
CHEMBL469374
Type:
Small organic molecule
Emp. Form.:
C25H27FN4O2
Mol. Mass.:
434.5059
SMILES:
CN1C(=O)COc2c(CCN3CCN(CC3)c3cc(F)cc4nc(C)ccc34)cccc12
: