Target
Potassium voltage-gated channel subfamily H member 2
Ligand
BDBM50289291
Substrate
Meas. Tech.
ChEMBL_540080 (CHEMBL1036648)
IC50
11481.54±n/a nM
Citation
 Coi, AMassarelli, ITestai, LCalderone, VBianucci, AM Identification of"toxicophoric" features for predicting drug-induced QT interval prolongation. Eur J Med Chem 43:2479-88 (2008)  
Target
Name:
Potassium voltage-gated channel subfamily H member 2
Synonyms:
1,3-beta-glucan synthase component GLS2 ERG Eag-related protein 1 Ether-a-go-go-related gene (HERG) Ether-a-go-go-related gene potassium channel 1 Ether-a-go-go-related gene potassium channel 1 (hERG1) Ether-a-go-go-related protein 1 H-ERG KCNH2 Potassium voltage-gated channel subfamily H member 2 (hERG) Voltage-gated potassium channel subunit Kv11.1 hERG Potassium Channel 1 | putative potassium channel subunit
Type:
Multi-pass membrane protein
Mol. Mass.:
126672.65
Organism:
Homo sapiens (Human)
Description:
Q12809
Residue:
1159
  
Inhibitor
Name:
BDBM50289291
Synonyms:
2-Hydroxy-methylolanzapine [10-(4-Methyl-piperazin-1-yl)-4H-3-thia-4,9-diaza-benzo[f]azulen-2-yl]-methanol
Type:
Small organic molecule
Emp. Form.:
C17H20N4OS
Mol. Mass.:
328.432
SMILES:
CN1CCN(CC1)C1=Nc2ccccc2Nc2sc(CO)cc12
: