Target
Tyrosine-protein phosphatase non-receptor type 1
Ligand
BDBM50414245
Substrate
Meas. Tech.
ChEMBL_570758 (CHEMBL1026933)
Ki
20±n/a nM
Citation
 Brown, SPMuchmore, SW Large-scale application of high-throughput molecular mechanics with Poisson-Boltzmann surface area for routine physics-based scoring of protein-ligand complexes. J Med Chem 52:3159-65 (2009)  
Target
Name:
Tyrosine-protein phosphatase non-receptor type 1
Synonyms:
PTN1_HUMAN PTPN1 Protein tyrosine phosphatase-1B (PTP1B) Protein-tyrosine phosphatase 1B (PTP1B) Tyrosine-protein phosphatase non-receptor type 1 (PTP1B)
Type:
Protein phosphatase
Mol. Mass.:
49963.76
Organism:
Homo sapiens (Human)
Description:
Human recombinant GST-fusion PTP1B (1-435).
Residue:
435
  
Inhibitor
Name:
BDBM50414245
Synonyms:
CHEMBL558555
Type:
Small organic molecule
Emp. Form.:
C39H43N5O11
Mol. Mass.:
757.7856
SMILES:
CCCCCNC(=O)C(Cc1ccc(N(C(=O)C(O)=O)c2ccccc2C(O)=O)c(\C=C\C(N)=O)c1)NC(=O)C(Cc1ccccc1)NC(=O)CCC(O)=O
: