Target
Neuropeptide FF receptor 2
Ligand
BDBM50414848
Substrate
Meas. Tech.
ChEMBL_590509 (CHEMBL1058556)
EC50
1000±n/a nM
Citation
 Gaubert, GBertozzi, FKelly, NMPawlas, JScully, ALNash, NRGardell, LRLameh, JOlsson, R Discovery of selective nonpeptidergic neuropeptide FF2 receptor agonists. J Med Chem 52:6511-4 (2009)  
Target
Name:
Neuropeptide FF receptor 2
Synonyms:
G-protein coupled receptor 74 GPR74 NPFF2_HUMAN NPGPR Neuropeptide G-protein coupled receptor
Type:
Enzyme Catalytic Domain
Mol. Mass.:
60293.78
Organism:
Homo sapiens (Human)
Description:
NPFF2 0 HUMAN::Q9Y5X5
Residue:
522
  
Inhibitor
Name:
BDBM50414848
Synonyms:
CHEMBL572531
Type:
Small organic molecule
Emp. Form.:
C8H8Cl2N4
Mol. Mass.:
231.082
SMILES:
[#7]\[#6](-[#7])=[#7]\[#7]=[#6]-c1ccc(Cl)c(Cl)c1
: