Target
Neuropeptide FF receptor 1
Ligand
BDBM50414855
Substrate
Meas. Tech.
ChEMBL_590511 (CHEMBL1058558)
EC50
125.89±n/a nM
Citation
 Gaubert, GBertozzi, FKelly, NMPawlas, JScully, ALNash, NRGardell, LRLameh, JOlsson, R Discovery of selective nonpeptidergic neuropeptide FF2 receptor agonists. J Med Chem 52:6511-4 (2009)  
Target
Name:
Neuropeptide FF receptor 1
Synonyms:
G-protein coupled receptor 147 NPFF1 NPFFR1 | RFamide-related peptide receptor OT7T022
Type:
PROTEIN
Mol. Mass.:
47840.07
Organism:
Homo sapiens (Human)
Description:
ChEMBL_1474637
Residue:
430
  
Inhibitor
Name:
BDBM50414855
Synonyms:
CHEMBL573518
Type:
Small organic molecule
Emp. Form.:
C13H11F3N4S
Mol. Mass.:
312.313
SMILES:
[#7]\[#6](-[#7])=[#7]\[#7]=[#6]-c1ccc(s1)-c1ccccc1C(F)(F)F
: