Target
Androgen receptor
Ligand
BDBM50415086
Substrate
Meas. Tech.
ChEMBL_597019 (CHEMBL1041863)
EC50
0.251±n/a nM
Citation
 Schlienger, NLund, BWPawlas, JBadalassi, FBertozzi, FLewinsky, RFejzic, AThygesen, MBTabatabaei, ABradley, SRGardell, LRPiu, FOlsson, R Synthesis, structure-activity relationships, and characterization of novel nonsteroidal and selective androgen receptor modulators. J Med Chem 52:7186-91 (2009)  
Target
Name:
Androgen receptor
Synonyms:
ANDR_HUMAN Androgen Receptor Androgen receptor/Baculoviral IAP repeat-containing protein 2 Dihydrotestosterone receptor Nuclear receptor subfamily 3 group C member 4
Type:
Receptor
Mol. Mass.:
99185.27
Organism:
Homo sapiens (Human)
Description:
CHO cells were stably transfected with human AR gene.
Residue:
920
  
Inhibitor
Name:
BDBM50415086
Synonyms:
ACP-105 | CHEMBL570435
Type:
Small organic molecule
Emp. Form.:
C16H19ClN2O
Mol. Mass.:
290.788
SMILES:
Cc1c(Cl)c(ccc1N1[C@@H]2CC[C@@H]1CC(C)(O)C2)C#N
: