Target
Androgen receptor
Ligand
BDBM50415087
Substrate
Meas. Tech.
ChEMBL_597011 (CHEMBL1041855)
EC50
3.98±n/a nM
Citation
 Schlienger, NLund, BWPawlas, JBadalassi, FBertozzi, FLewinsky, RFejzic, AThygesen, MBTabatabaei, ABradley, SRGardell, LRPiu, FOlsson, R Synthesis, structure-activity relationships, and characterization of novel nonsteroidal and selective androgen receptor modulators. J Med Chem 52:7186-91 (2009)  
Target
Name:
Androgen receptor
Synonyms:
ANDR_MOUSE Nr3c4
Type:
PROTEIN
Mol. Mass.:
98196.62
Organism:
Mus musculus
Description:
ChEMBL_945930
Residue:
899
  
Inhibitor
Name:
BDBM50415087
Synonyms:
CHEMBL570237
Type:
Small organic molecule
Emp. Form.:
C18H18N2
Mol. Mass.:
262.3489
SMILES:
N#Cc1ccc(N2[C@@H]3CC[C@@H]2CCC3)c2ccccc12
: