Target
Melatonin receptor type 1A
Ligand
BDBM50416701
Substrate
Meas. Tech.
ChEMBL_652045 (CHEMBL1227855)
Ki
63095.73±n/a nM
Citation
 Carocci, ACatalano, ALovece, ALentini, GDuranti, ALucini, VPannacci, MScaglione, FFranchini, C Design, synthesis, and pharmacological effects of structurally simple ligands for MT(1) and MT(2) melatonin receptors. Bioorg Med Chem 18:6496-511 (2010)  
Target
Name:
Melatonin receptor type 1A
Synonyms:
MTNR1A MTR1A_HUMAN Mel1a melatonin receptor Melatonin receptor Melatonin receptor type 1 (MT1) | Melatonin receptor type 1A
Type:
Enzyme
Mol. Mass.:
39392.94
Organism:
Homo sapiens (Human)
Description:
P48039
Residue:
350
  
Inhibitor
Name:
BDBM50416701
Synonyms:
CHEMBL1223274
Type:
Small organic molecule
Emp. Form.:
C11H15NO2
Mol. Mass.:
193.2423
SMILES:
C[C@H](COc1ccccc1)NC(C)=O
: