Target
Melatonin receptor type 1B
Ligand
BDBM50416701
Substrate
Meas. Tech.
ChEMBL_652046 (CHEMBL1227856)
Ki
53703.18±n/a nM
Citation
 Carocci, ACatalano, ALovece, ALentini, GDuranti, ALucini, VPannacci, MScaglione, FFranchini, C Design, synthesis, and pharmacological effects of structurally simple ligands for MT(1) and MT(2) melatonin receptors. Bioorg Med Chem 18:6496-511 (2010)  
Target
Name:
Melatonin receptor type 1B
Synonyms:
MTNR1B Mel-1B-R Melatonin 1B Melatonin receptor type 1B | Melatonin receptor type 2 (MT2)
Type:
Enzyme
Mol. Mass.:
40203.54
Organism:
Homo sapiens (Human)
Description:
P49286
Residue:
362
  
Inhibitor
Name:
BDBM50416701
Synonyms:
CHEMBL1223274
Type:
Small organic molecule
Emp. Form.:
C11H15NO2
Mol. Mass.:
193.2423
SMILES:
C[C@H](COc1ccccc1)NC(C)=O
: