Target
Alpha-1A adrenergic receptor
Ligand
BDBM50026917
Substrate
Meas. Tech.
ChEMBL_658237 (CHEMBL1246629)
Ki
380.19±n/a nM
Citation
 Franchini, SPrandi, ABaraldi, ASorbi, CTait, ABuccioni, MMarucci, GCilia, APirona, LFossa, PCichero, EBrasili, L 1,3-Dioxolane-based ligands incorporating a lactam or imide moiety: structure-affinity/activity relationship at alpha1-adrenoceptor subtypes and at 5-HT1A receptors. Eur J Med Chem 45:3740-51 (2010)  
Target
Name:
Alpha-1A adrenergic receptor
Synonyms:
ADA1A_HUMAN ADRA1C Alpha 1A-adrenoceptor Alpha adrenergic receptor 1a Alpha-adrenergic receptor 1c adrenergic Alpha1 | adrenergic Alpha1C
Type:
Cell-surface receptors
Mol. Mass.:
51511.67
Organism:
Homo sapiens (Human)
Description:
P35348
Residue:
466
  
Inhibitor
Name:
BDBM50026917
Synonyms:
8-(2-(4-(2-methoxyphenyl)piperazin-1-yl)ethyl)-8-azaspiro[4.5]decane-7,9-dione 8-{2-[4-(2-Methoxy-phenyl)-piperazin-1-yl]-ethyl}-8-aza-spiro[4.5]decane-7,9-dione BMY 7378 CHEMBL1256934 CHEMBL543741
Type:
Small organic molecule
Emp. Form.:
C22H31N3O3
Mol. Mass.:
385.4998
SMILES:
COc1ccccc1N1CCN(CCN2C(=O)CC3(CCCC3)CC2=O)CC1
: