Target
Amine oxidase [flavin-containing] A
Ligand
BDBM11022
Substrate
Meas. Tech.
ChEMBL_676159 (CHEMBL1273210)
IC50
56234±n/a nM
Citation
 Fioravanti, RBolasco, AManna, FRossi, FOrallo, FYáñez, MVitali, AOrtuso, FAlcaro, S Synthesis and molecular modelling studies of prenylated pyrazolines as MAO-B inhibitors. Bioorg Med Chem Lett 20:6479-82 (2010)  
Target
Name:
Amine oxidase [flavin-containing] A
Synonyms:
AOFA_HUMAN MAO-A Monoamine oxidase Monoamine oxidase type A (MAO A) Monoamine oxidase type A (MAOA)
Type:
Protein
Mol. Mass.:
59689.53
Organism:
Homo sapiens (Human)
Description:
P21397
Residue:
527
  
Inhibitor
Name:
BDBM11022
Synonyms:
2,3-dihydro-1H-indole-2,3-dione Isatin | Isatin (Compound 1)
Type:
Small organic molecule
Emp. Form.:
C8H5NO2
Mol. Mass.:
147.1308
SMILES:
O=C1Nc2ccccc2C1=O
: