Target
C-C motif chemokine 2
Ligand
BDBM14029
Substrate
Meas. Tech.
ChEMBL_700342 (CHEMBL1647668)
IC50
2630.27±n/a nM
Citation
 Ray, PWright, JAdam, JBennett, JBoucharens, SBlack, DCook, ABrown, AREpemolu, OFletcher, DHaunso, AHuggett, MJones, PLaats, SLyons, AMestres, Jde Man, JMorphy, RRankovic, ZSherborne, BSherry, Lvan Straten, NWestwood, PZaman, GZ Fragment-based discovery of 6-substituted isoquinolin-1-amine based ROCK-I inhibitors. Bioorg Med Chem Lett 21:97-101 (2010)  
Target
Name:
C-C motif chemokine 2
Synonyms:
CCL2 HC11 MCP-1 Monocyte chemoattractant protein 1 Monocyte chemotactic protein 1 SCYA2 | Small-inducible cytokine A2
Type:
PROTEIN
Mol. Mass.:
11032.44
Organism:
Homo sapiens (Human)
Description:
ChEMBL_1363188
Residue:
99
  
Inhibitor
Name:
BDBM14029
Synonyms:
(R)-TRANS-4-(1-AMINOETHYL)-N-(4-PYRIDYL) CYCLOHEXANECARBOXAMIDE US10183931, Y-27632 | Y-27632
Type:
Small organic molecule
Emp. Form.:
C14H21N3O
Mol. Mass.:
247.336
SMILES:
[H][C@@]1(CC[C@@]([H])(CC1)C(=O)Nc1ccncc1)[C@@H](C)N
: