Target
Dipeptidyl peptidase 1
Ligand
BDBM50417990
Substrate
Meas. Tech.
ChEMBL_719162 (CHEMBL1679621)
IC50
1000±n/a nM
Citation
 Lainé, DPalovich, MMcCleland, BPetitjean, EDelhom, IXie, HDeng, JLin, GDavis, RJolit, ANevins, NZhao, BVilla, JSchneck, JMcDevitt, PMidgett, RKmett, CUmbrecht, SPeck, BDavis, ABBettoun, D Discovery of novel cyanamide-based inhibitors of cathepsin C. ACS Med Chem Lett 2:142-147 (2011)  
Target
Name:
Dipeptidyl peptidase 1
Synonyms:
CATC_HUMAN CTSC Cathepsin J Dipeptidyl peptidase 1 (DPPI) Dipeptidyl peptidase I (DPPI)
Type:
Enzyme
Mol. Mass.:
51857.28
Organism:
Homo sapiens (Human)
Description:
P53634
Residue:
463
  
Inhibitor
Name:
BDBM50417990
Synonyms:
CHEMBL1672424
Type:
Small organic molecule
Emp. Form.:
C12H14N4O
Mol. Mass.:
230.2658
SMILES:
O=C(N[C@@H]1CCN(C1)C#N)Nc1ccccc1
: