Target
Cathepsin S
Ligand
BDBM50417996
Substrate
Meas. Tech.
ChEMBL_719166 (CHEMBL1679625)
IC50
1000±n/a nM
Citation
 Lainé, DPalovich, MMcCleland, BPetitjean, EDelhom, IXie, HDeng, JLin, GDavis, RJolit, ANevins, NZhao, BVilla, JSchneck, JMcDevitt, PMidgett, RKmett, CUmbrecht, SPeck, BDavis, ABBettoun, D Discovery of novel cyanamide-based inhibitors of cathepsin C. ACS Med Chem Lett 2:142-147 (2011)  
Target
Name:
Cathepsin S
Synonyms:
CATS_HUMAN Cathepsin S (Cat S) | cathepsin S preproprotein
Type:
Protein
Mol. Mass.:
37507.38
Organism:
Homo sapiens (Human)
Description:
P25774
Residue:
331
  
Inhibitor
Name:
BDBM50417996
Synonyms:
CHEMBL1672434
Type:
Small organic molecule
Emp. Form.:
C12H13Br2N3O2S
Mol. Mass.:
423.124
SMILES:
C[C@H]1C[C@H](CN1C#N)NS(=O)(=O)c1cc(Br)ccc1Br
: