Target
Free fatty acid receptor 1
Ligand
BDBM50240347
Substrate
Meas. Tech.
ChEMBL_830235 (CHEMBL2060786)
EC50
2884.03±n/a nM
Citation
 Shimpukade, BHudson, BDHovgaard, CKMilligan, GUlven, T Discovery of a potent and selective GPR120 agonist. J Med Chem 55:4511-5 (2012)  
Target
Name:
Free fatty acid receptor 1
Synonyms:
FFAR1 G-protein Coupled Receptor 40 | GPR40
Type:
G Protein-Coupled Receptor (GPCR)
Mol. Mass.:
31473.32
Organism:
Homo sapiens (Human)
Description:
O14842
Residue:
300
  
Inhibitor
Name:
BDBM50240347
Synonyms:
(9,12,15)-linolenic acid (Z,Z,Z)-9,12,15-octadecatrienoic acid ALA all-cis-9,12,15-octadecatrienoic acid cid_5280934 cis-Delta(9,12,15)-octadecatrienoic acid | linolenic acid
Type:
Small organic molecule
Emp. Form.:
C18H30O2
Mol. Mass.:
278.4296
SMILES:
CC\C=C/C\C=C/C\C=C/CCCCCCCC(O)=O
: