Target
Broad substrate specificity ATP-binding cassette transporter ABCG2
Ligand
BDBM20625
Substrate
Meas. Tech.
ChEMBL_835942 (CHEMBL2077080)
IC50
500±n/a nM
Citation
 Sugimoto, YTsukahara, SImai, YSugimoto, YUeda, KTsuruo, T Reversal of breast cancer resistance protein-mediated drug resistance by estrogen antagonists and agonists. Mol Cancer Ther 2:105-12 (2003) Target
Name:
Broad substrate specificity ATP-binding cassette transporter ABCG2
Synonyms:
ABCG2 ABCP ATP-binding cassette sub-family G member 2 ATP-binding cassette, sub-family G, member 2 BCRP1 CDw338 Mitoxantrone resistance-associated protein Urate exporter
Type:
Multi-pass membrane protein; monomer or homodimer; disulfide-linked
Mol. Mass.:
72329.48
Organism:
Homo sapiens (Human)
Description:
Q9UNQ0
Residue:
655
  
Inhibitor
Name:
BDBM20625
Synonyms:
4-[(3E)-4-(4-hydroxyphenyl)hex-3-en-3-yl]phenol CHEMBL411 Diethylstilbestrol (1) Stilboestroform
Type:
Small organic molecule
Emp. Form.:
C18H20O2
Mol. Mass.:
268.3502
SMILES:
CC\C(=C(\CC)c1ccc(O)cc1)c1ccc(O)cc1
: