Target
Solute carrier family 22 member 1
Ligand
BDBM50403559
Substrate
Meas. Tech.
ChEMBL_838713 (CHEMBL2078495)
Ki
5700±n/a nM
Citation
 Urakami, YOkuda, MMasuda, SSaito, HInui, KI Functional characteristics and membrane localization of rat multispecific organic cation transporters, OCT1 and OCT2, mediating tubular secretion of cationic drugs. J Pharmacol Exp Ther 287:800-5 (1998) Target
Name:
Solute carrier family 22 member 1
Synonyms:
Adrenaline alpha1 Organic cation transporter 1 Slc22a1 adrenergic Alpha1 | rOCT1
Type:
Enzyme Catalytic Domain
Mol. Mass.:
61538.40
Organism:
RAT
Description:
Adrenaline alpha1 0 RAT::Q63089
Residue:
556
  
Inhibitor
Name:
BDBM50403559
Synonyms:
Brumetadina | CIMETIDINE
Type:
Small organic molecule
Emp. Form.:
C10H16N6S
Mol. Mass.:
252.339
SMILES:
CNC(NCCSCc1[nH]cnc1C)=NC#N
: