Target
Solute carrier family 22 member 1
Ligand
BDBM50373877
Substrate
Meas. Tech.
ChEMBL_838514 (CHEMBL2078142)
Ki
736000±n/a nM
Citation
 Urakami, YOkuda, MMasuda, SAkazawa, MSaito, HInui, K Distinct characteristics of organic cation transporters, OCT1 and OCT2, in the basolateral membrane of renal tubules. Pharm Res 18:1528-34 (2001)  
Target
Name:
Solute carrier family 22 member 1
Synonyms:
Adrenaline alpha1 Organic cation transporter 1 Slc22a1 adrenergic Alpha1 | rOCT1
Type:
Enzyme Catalytic Domain
Mol. Mass.:
61538.40
Organism:
RAT
Description:
Adrenaline alpha1 0 RAT::Q63089
Residue:
556
  
Inhibitor
Name:
BDBM50373877
Synonyms:
Betaxin THIAMINE (VIT B1) Thiamine | Vitamin B 1
Type:
Small organic molecule
Emp. Form.:
C12H17N4OS
Mol. Mass.:
265.354
SMILES:
Cc1c(CCO)sc[n+]1Cc1cnc(C)nc1N
: