Target
Bile salt export pump
Ligand
BDBM50012957
Substrate
Meas. Tech.
ChEMBL_836622 (CHEMBL2077363)
IC50
15700±n/a nM
Citation
 Funk, CPantze, MJehle, LPonelle, CScheuermann, GLazendic, MGasser, R Troglitazone-induced intrahepatic cholestasis by an interference with the hepatobiliary export of bile acids in male and female rats. Correlation with the gender difference in troglitazone sulfate formation and the inhibition of the canalicular bile salt export pump (Bsep) by troglitazone and trogl Toxicology 167:83-98 (2001)  
Target
Name:
Bile salt export pump
Synonyms:
ABCBB_RAT Abcb11 Bile salt export pump Sister of P-glycoprotein | Spgp
Type:
PROTEIN
Mol. Mass.:
146267.86
Organism:
Rattus norvegicus
Description:
ChEMBL_1481883
Residue:
1321
  
Inhibitor
Name:
BDBM50012957
Synonyms:
1-((p-(2-(5-chloro-o-anisamido)ethyl)phenyl)sulfonyl)-3-cyclohexylurea 5-chloro-N-(2-(4-((((cyclohexylamino)carbonyl)amino)sulfonyl)phenyl)ethyl)-2-methoxybenzamide CHEMBL472 Glibenclamide | US20230348371, Compound 5
Type:
Small organic molecule
Emp. Form.:
C23H28ClN3O5S
Mol. Mass.:
494.004
SMILES:
COc1ccc(Cl)cc1C(=O)NCCc1ccc(cc1)S(=O)(=O)NC(=O)NC1CCCCC1
: